{"text_format":"1","workbook":"xlsx","n_sheets":4,"sheets":["Vorbemerkung","Berechnungsschema","DDorfer","Abänderung"],"not_rendered":{"charts":0,"images":0,"macros":0,"external_links":1,"defined_names":42,"comments":0,"pivot_tables":0},"unopened":[],"bounds":{"document_bytes":16777216,"sheet_cells":100000,"rows_first":2000,"rows_last":500,"rows_between":2000,"halvings":0,"cell_chars":16384,"cell_head_chars":4096},"cells_cut":0,"cells_raw":0,"read":"whole","date_system":"1900"}

{"sheet":"Vorbemerkung","index":0,"n_rows":3,"n_cols":2,"rows_kept":3,"cut":false,"hidden":false,"merged":[[0,1,1,8],[2,1,40,8],[0,0,1048575,0],[0,9,1048575,9]]}
[null,"Vorbemerkung"]
[]
[null,"Die Berechnung des Kinderunterhalts in Fällen, in denen beide Eltern erhebliche Betreuungsanteile übernehmen, ist nicht ganz banal. Dies hängt unter anderem damit zusammen, dass durch die Residenz der Kinder in zwei unterschiedlichen Haushalten ein unterhaltsrechtlicher Mehrbedarf entstehen kann, der in erhöhtem Wohnkostenbedarf, erhöhten Transportkosten aber auch einfach dadurch entsteht, dass ein Teil des Equipments der Kinder in beiden Haushalten vorhanden sein muss. Durch diese Mehrkosten unterscheidet sich eine Unterhaltsberechnung für Kinder in zwei Residenzhaushalten deutlich von der Situation eines Residenzmodells bei einem Elternteil mit mehr oder minder ausgedehnten Umgangsanteilen des anderen Elternteils.\n\nIn dem hier vorgeschlagenen Berechnungsmodell kann nicht nur beim nahezu paritätischen Betreuungsmodell der Unterhaltsbedarf, und die von den Eltern aufzubringenden Deckungsanteile für diesen Bedarf, berechnet werden, sondern bis zu einer Verteilung 30:70 kann ein Verteilungsvorschlag entwickelt werden.\n\nDie Rechtsprechung des Bundesgerichtshofs nimmt eine solche Verteilung nur bei annähernd Parität der Betreuungsanteile der beiden Eltern an. Dies erscheint nicht gerechtfertigt.\n\nDie Unterhaltsverteilung im Wechselmodell ist allerdings sehr abhängig von den konkreten Bedingungen und für ein streitiges Unterhaltsverfahren wenig geeignet. Bei Streit um die Unterhaltsverteilung werden die Eltern dazu neigen, ihre Betreuungsanteile zulasten des anderen Elternteils zu erhöhen. Damit wäre auch ein beiderseitiges Betreuungsmodell gescheitert. Deshalb eignet sich das hier vorgeschlagene Berechnungsmodell eher dazu, für die betreuenden Elternteile einen Verteilungsvorschlag zu entwickeln, als ein wirklich belastbares Berechnungsmodell.\n\nGerade in Fällen beiderseitiger Betreuung der Kinder durch die Eltern nach Trennung und Scheidung geht es darum, angemessene Lösungen zu entwickeln. Solche Lösungen sind in aller Regel nicht in standardisierten Rechenschablonen zu entwickeln.\n\nJedes Berechnungsergebnis im Unterhaltsrecht ist stets auf Angemessenheit zu überprüfen. Für Laien ist es immer empfehlenswert, bei der Entwicklung einer Unterhaltslösung anwaltlichen Rat einzuholen.\n\nDuisburg, im Dezember 2017\n\nJörn Hauß"]

{"sheet":"Berechnungsschema","index":1,"n_rows":84,"n_cols":21,"rows_kept":84,"cut":false,"hidden":false,"merged":[[82,1,82,4],[83,1,83,4],[67,1,67,4],[68,1,68,4],[69,1,69,4],[70,1,70,4],[71,1,71,4],[78,1,78,4],[79,1,79,4],[80,1,80,4],[81,1,81,4],[75,1,75,4],[76,1,76,4],[77,1,77,4],[74,1,74,4],[72,1,72,4],[0,11,0,12],[58,1,58,6],[59,1,59,4],[60,1,60,4],[61,1,61,4],[56,1,56,4],[57,1,57,4],[13,5,13,6],[10,1,11,4],[10,5,11,6],[0,1,0,6],[1,1,1,6],[4,5,4,6],[9,1,9,4],[13,1,13,4],[5,2,5,3],[6,1,6,4],[7,1,7,4],[8,1,8,4],[3,1,3,4],[12,7,12,8],[13,7,13,8],[42,7,42,8],[43,7,43,8],[65,1,65,4],[66,1,66,4],[73,1,73,4],[21,1,21,4],[24,1,24,4],[25,1,25,4],[62,5,62,6],[63,5,63,6],[32,1,32,4],[33,1,33,4],[34,1,34,4],[36,2,36,3],[64,5,64,6],[65,5,65,6],[66,5,66,6],[44,1,44,4],[63,2,63,3],[55,1,55,4],[40,1,40,4],[51,1,51,4],[48,1,48,4],[43,1,43,4],[54,1,54,4],[64,1,64,4],[10,0,11,0],[17,11,17,12],[17,10,18,10],[37,1,38,4],[37,5,38,6],[34,10,35,10],[7,9,14,9],[12,1,12,4],[27,1,27,4],[28,1,28,4],[36,5,36,6],[11,7,11,8],[9,5,9,6],[12,5,12,6],[16,1,16,4],[15,1,15,4],[35,5,35,6],[26,1,26,4],[20,1,20,4],[18,1,18,4],[19,1,19,4],[1,11,6,11],[20,10,22,12],[44,10,45,10],[30,1,30,4],[44,7,44,8],[23,1,23,4],[14,1,14,4],[39,5,39,6],[41,1,41,4],[60,9,67,9],[60,10,61,10],[7,11,7,12],[7,10,8,10],[42,1,42,4],[39,1,39,4],[40,5,40,6],[1,7,1,8],[5,7,5,8],[5,5,5,6],[53,1,53,4],[45,7,45,8],[65,7,65,8],[45,1,45,4],[46,1,46,4],[47,1,47,4],[49,1,49,4],[52,1,52,4],[50,1,50,4],[17,1,17,4],[22,1,22,4],[29,1,29,4],[31,1,31,6],[25,10,25,11]]}
[null,"Unterhaltsverteilung bei Betreuung von Kindern getrennt lebender Eltern durch beide Eltern",null,null,null,null,null,null,null,null,null,"Bei Aktivierung dieser Option wird der Wohnmehrbedarf für jeden Elternteil mit 20% des Tabellenbedarfs kalkuliert",null,null,"Runden",3]
[null,"Die gelb hinterlegten Felder können ausgefüllt werden. Keine Mangelfallberechnung möglich! Navigation mit Tab-Taste.\n©Rechtsanwalt Jörn Hauß, Vom-Rath-Str. 10, 47051 Duisburg, Tel: 0203/286870, Hauss@anwaelte-du.de",null,null,null,null,null,null,null,null,{"$f":"IF(T7>1,\"Einkommensstufe manuell gewählt!\",\"\")","v":""},{"$f":"\"Zur Erzielung eines ange-messenen Ergebnisses kann die Ein-kommensstufe auch manuell gewählt werden\"&CHAR(10)&\" >>>>>>>>>\"","v":"Zur Erzielung eines ange-messenen Ergebnisses kann die Ein-kommensstufe auch manuell gewählt werden\n >>>>>>>>>"},null,null,null,null,null,{"$f":"+R9+F13","v":0}]
[1,"Berechnungsdatum:",null,null,{"$f":"TODAY()","v":"2022-01-18"},"Vater","Mutter"]
[2,"bereinigtes anrechenbares Nettoeinkommen:",null,null,null,null,null,null,null,null,{"$f":"IFERROR(\"Einkommensstufe: \"&TEXT(T9,\"#\"),\"\")","v":"Einkommensstufe: 1"}]
[3,"Namen der Kinder eingebeni",null,null,"Geburtstagi","Tabellenunterhalt"]
[4,null,null,null,null,{"$f":"IFERROR(IF(E6=\"\",0,VLOOKUP(T9,IF(YEAR(Berechnungsdatum)<2021,DDorf21,DDorf22),P9+2)),\"\")","v":0},null,null,null,null,{"$f":"IF(E6=\"\",\"\",\"Altersstufe: \"&TEXT(P9,\"0\"))","v":""}]
[7,"Selbstbehalt nach Düsseldorfer Tabelle",null,null,null,{"$f":"IFERROR(IF(F4=0,0,-VLOOKUP(Berechnungsdatum,Selbstbehalte,IF(Mangelfall=1,3,5))),\"\")","v":0},{"$f":"IFERROR(IF(G4=0,0,-VLOOKUP(Berechnungsdatum,Selbstbehalte,IF(Mangelfall=1,3,5))),\"\")","v":0},null,null,null,null,null,null,null,"Alter","Gruppe","Mindestbedarf","Bdf nach E Vater","Bdf nach E Mutter",1,"automatisch"]
[8,{"$f":"IFERROR(\"Einkommensteil zur Erfüllung von Unterhaltsansprüchen: \"&IF(F4>0,TEXT(F4,\"#.##0,00\")&\" - \"&TEXT(ABS(F7),\"#.##0,00\")&\" / \",\"\")&IF(G4>0,TEXT(G4,\"#.##0,00\")&\" - \"&TEXT(ABS(G7),\"#.##0,00\"),\"\"),\"\")","v":"Einkommensteil zur Erfüllung von Unterhaltsansprüchen: "},null,null,null,{"$f":"IFERROR(IF(F4+F7<0,0,F4+F7),\"\")","v":0},{"$f":"IFERROR(IF(+G4+G7<0,0,+G4+G7),\"\")","v":0},null,null,null,"modellbedingter Mehrbedarf","getragen von:",null,null,null,null,null,null,null,"Tabellenstufe",1]
[9,{"$f":"\"Anteilsquote mit der der Bedarf zu erfüllen ist: \"&IF(F8>0,\"V: \"&TEXT(F8,\"#.##0,00\")&\"/(\"&TEXT(F8,\"#.##0,00\")&\" + \"&TEXT(G8,\"#.##0,00\")&\")\",\"\")&CHAR(10)&IF(G8>0,\".........................................................................M: \"&TEXT(G8,\"#.##0,00\")&\"/(\"&TEXT(G8,\"#.##0,00\")&\" + \"&TEXT(F8,\"#.##0,00\")&\")\",\"\")","v":"Anteilsquote mit der der Bedarf zu erfüllen ist: \n"},null,null,null,{"$f":"IFERROR(ROUND(F8/(F8+G8),Runden2),\"\")","v":""},{"$f":"IFERROR(ROUND(G8/(G8+F8),Runden2),\"\")","v":""},null,null,null,null,"Vater","Mutter",null,{"$f":"YEARFRAC(E6,Berechnungsdatum,3)","v":122.13424657534246},{"$f":"IF(O9=0,0,IF(O9>=18,4,IF(O9>=12,3,IF(Berechnungsschema!O9>=6,2,1))))","v":4},{"$f":"VLOOKUP(1,CHOOSE(YEAR(Berechnungsdatum)-2018,DDorfer19,DDorf20,DDorf21,DDorf22),P9+2)","v":569},{"$f":"IF(F4<1050,0,VLOOKUP(F4,CHOOSE(YEAR(Berechnungsdatum)-2018,DDorfer19,DDorf20,DDorferkomplett21,DDorf22),P9+1,TRUE))","v":0},{"$f":"IF(G4<1050,0,VLOOKUP(G$4,CHOOSE(YEAR(Berechnungsdatum)-2018,DDorfer19,DDorf20,DDorferkomplett21,DDorf22),P9+1))","v":0},{"$f":"IF(T$7>1,T$7-1,VLOOKUP(F$4+G$4,IF(YEAR(Berechnungsdatum)<2020,DDorf20komplett,DDorf21komplett),7))","v":1},2]
[10,{"$f":"IFERROR(IF(F6+F37=0,\"\",\"Erfüllungsquote des Gesamtbedarfs der Kinder: \"&IF(F10<1,\"(\"&IF(F8>0,TEXT(F8,\"#,00\"),\"0,00\")&IF(G8>0,\" + \"&TEXT(G8,\"0,00\")&\")\",\"0,00\")&\"/(\"&TEXT(F6,\"#,00\")&\" + \"&TEXT(F37,\"#,00\")&\")\",\"\")),\"\")","v":""},null,null,null,{"$f":"IFERROR(ROUND(IF(F37+F6=0,0,IF((F8+G8)/(F37+F13+F6+F40)<1,(F8+G8)/(F37+F13+F6+F40),1)),2),\"\")","v":0},null,null,null,null,{"$f":"IF(Wohnbedarfsreduktion,\"Wohnmehrkosten 20%\",\"\")","v":""},{"$f":"IF(L11>0,0,IF(Wohnbedarfsreduktion,F11*0.2,\"\"))","v":""},{"$f":"IF(M11>0,0,IF(Wohnbedarfsreduktion,F11*0.2,\"\"))","v":""},null,{"$f":"IF(E37=\"\",0,YEARFRAC(E37,Berechnungsdatum,3))","v":0},{"$f":"IF(O10=0,0,IF(O10>=18,4,IF(O10>=12,3,IF(Berechnungsschema!O10>=6,2,1))))","v":0},{"$f":"VLOOKUP(1,CHOOSE(YEAR(Berechnungsdatum)-2018,DDorfer19,DDorf20,DDorf21,DDorf22),P10+2)","v":0},{"$f":"IF(E37=0,0,VLOOKUP(F$4,CHOOSE(YEAR(Berechnungsdatum)-2018,DDorfer19,DDorf20,DDorf21,DDorf22),P10+1))","v":0},{"$f":"IF(G5<1050,0,VLOOKUP(G$4,CHOOSE(YEAR(Berechnungsdatum)-2018,DDorfer19,DDorf20,DDorferkomplett21,DDorf22),P10+1))","v":0},{"$f":"IF(T$7>1,T$7-1,VLOOKUP(F$4+G$4,IF(YEAR(Berechnungsdatum)<2020,DDorf20komplett,DDorf21komplett),7))","v":1},3]
[11,{"$f":"IFERROR(B6&\": Bedarf aus zusammengerechnetem Einkommen nach Düsseldorfer Tabelle \"&TEXT(P9,\"#\")&\"/\"&TEXT(T9,\"#\")&IF(Mangelfall=1,\" Mangelfall\",\"\"),\"\")","v":": Bedarf aus zusammengerechnetem Einkommen nach Düsseldorfer Tabelle 4/1 Mangelfall"},null,null,null,{"$f":"IFERROR(IF(E6=0,0,IF(Mangelfall=0,F6,VLOOKUP(1,CHOOSE(YEAR(Berechnungsdatum)-2018,DDorfer19,DDorf20,DDorf21),P9+2))),\"\")","v":0},null,null,null,null,"Wohnkosten:",null,null,null,null,{"$f":"IF(O11=0,0,IF(O11>=18,4,IF(O11>=12,3,IF(Berechnungsschema!O11>=6,2,1))))","v":0},{"$f":"VLOOKUP(1,CHOOSE(YEAR(Berechnungsdatum)-2018,DDorfer19,DDorf20,DDorf21,DDorf22),P11+2)","v":0},{"$f":"IF(E38=0,0,VLOOKUP(F$4,CHOOSE(YEAR(Berechnungsdatum)-2018,DDorfer19,DDorf20,DDorf21,DDorf22),P11+1))","v":0},{"$f":"IF(G6<1050,0,VLOOKUP(G$4,CHOOSE(YEAR(Berechnungsdatum)-2018,DDorfer19,DDorf20,DDorferkomplett21,DDorf22),P11+1))","v":0},{"$f":"IF(T$7>1,T$7-1,VLOOKUP(F$4+G$4,IF(YEAR(Berechnungsdatum)<2020,DDorf20komplett,DDorf21komplett),7))","v":1},4]
[null,null,null,null,null,null,null,null,null,null,"Fahrtkosten:",null,null,null,{"$f":"IF(E64=\"\",0,YEARFRAC(E64,Berechnungsdatum,3))","v":0},{"$f":"IF(O12=0,0,IF(O12>=18,4,IF(O12>=12,3,IF(Berechnungsschema!O12>=6,2,1))))","v":0},{"$f":"VLOOKUP(1,CHOOSE(YEAR(Berechnungsdatum)-2018,DDorfer19,DDorf20,DDorf21,DDorf22),P12+2)","v":0},{"$f":"IF(E64=0,0,VLOOKUP(F$4,CHOOSE(YEAR(Berechnungsdatum)-2018,DDorfer19,DDorf20,DDorf21,DDorf22),P12+1))","v":0},{"$f":"IF(G7<1050,0,VLOOKUP(G$4,CHOOSE(YEAR(Berechnungsdatum)-2018,DDorfer19,DDorf20,DDorferkomplett21,DDorf22),P12+1))","v":0},{"$f":"IF(T$7>1,T$7-1,VLOOKUP(F$4+G$4,IF(YEAR(Berechnungsdatum)<2020,DDorf20komplett,DDorf21komplett),7))","v":1},5]
[12,"Barbedarfsanteil des Kindergeldes wird bei beiderseitigen Elterneinkünften in Zeile 25 berücksichtigt",null,null,null,{"$f":"IFERROR(IF(Geburtstag1=\"\",0,-VLOOKUP(Berechnungsdatum,Kindergeldtabelle,2)/2),\"\")","v":0},null,null,null,null,"Betreuungskosten:",null,null,null,null,{"$f":"IF(E37=\"\",\"\",\"Altersstufe: \"&TEXT(P10,\"0\"))","v":""},{"$f":"VLOOKUP(1,CHOOSE(YEAR(Berechnungsdatum)-2018,DDorfer19,DDorf20,DDorf21,DDorf22),1)","v":1},null,null,null,6]
[13,{"$f":"\"Regelbarbedarf nach Düsseldorfer Tabelle \"&IF(Wohnbedarfsreduktion,\" um Kosten des Wohnens in Höhe von 20% reduziert\",\"\")","v":"Regelbarbedarf nach Düsseldorfer Tabelle "},null,null,null,{"$f":"IFERROR((F13+F11*IF(Wohnbedarfsreduktion,0.8,1))*F$10,\"\")","v":0},null,null,null,null,"Kindergarten:",null,null,null,null,null,null,null,null,null,7]
[14,{"$f":"\"Barbedarfsanteile nach Einkommen: Vater: \"&TEXT(F14,\"0,00\")&\" x \"&TEXT(F$9,\"0,0%\")&\" / Mutter: \"&TEXT(F14,\"0,00\")&\" x \"&TEXT(G$9,\"0,0%\")","v":"Barbedarfsanteile nach Einkommen: Vater: 0,00 x  / Mutter: 0,00 x "},null,null,null,{"$f":"ROUND(IFERROR(F14*F$9,0),Runden2)","v":0},{"$f":"ROUND(IFERROR(F14*G$9,0),Runden2)","v":0},null,null,null,"Sonstiges:",null,null,null,{"$f":"+F9*F19","v":{"$error":"#VALUE!"}},{"$f":"+G9*G19","v":{"$error":"#VALUE!"}},null,"Summe der Einkünfte:",{"$f":"+G4+F4","v":0},null,8]
[15,"Wohn- und sonstiger Mehrbedarf für das Kind bei dem Elternteil, bei dem er entsteht",null,null,null,{"$f":"ROUND(L16,Runden2)","v":0},{"$f":"ROUND(M16,Runden2)","v":0},null,null,"<",{"$f":"\"<<<<<<<<<<Summe: \"&TEXT(L16+M16,\"#.##0,00\")","v":"<<<<<<<<<<Summe: 0,00"},{"$f":"SUM(L10:L15)","v":0},{"$f":"SUM(M10:M15)","v":0},null,null,null,null,"Selbstbehalte",-2600,null,9]
[16,{"$f":"\"Begrenzung nach Einkommen Vater: (\"&IF(R$9>0,TEXT(R$9,\"0,00\")&\" - \"&TEXT(ABS(F13),\"0,00\")&\")\"&IF(F16>0,\" + \"&TEXT(F16+G16,\"0,00\")&\") x \"&TEXT(F$9,\"0%\"),\"\"),\"\")&IF(S$9>0,\" / Mutter: (\"&TEXT(S$9,\"0,00\")&\" - \"&TEXT(ABS(F13),\"0,00\")&\")\"&IF(F16+G16>0,\" + \"&TEXT(G16+F16,\"0,00\")&\") x \"&TEXT(G$9,\"0%\"),\"\"),\"\")","v":"Begrenzung nach Einkommen Vater: ("},null,null,null,{"$f":"IF(F$4=0,0,VLOOKUP(F$4,IF(YEAR(Berechnungsdatum)<2021,DDorf20,DDorf22),P$9+1)+F13+(F16+G16)*F$9)","v":0},{"$f":"IF(S$9>0,VLOOKUP(G$4,IF(YEAR(Berechnungsdatum)<2021,DDorf20,DDorf21komplett),P$9+1)+F13+(F16+G16)*G$9,0)","v":0},null,null,null,null,null,null,null,false,null,null,"Rest",{"$f":"+S16+S15","v":-2600},null,10]
[16,{"$f":"IF(O22+P22=0,\"quotale Zahlbeträge aus Bedarf von \"&TEXT(P21,\"#.##0,00 €\")&IF(F1>0,\" (\"&TEXT(F14,\"0,00\")&\" + \"&TEXT(F16+G16,\"0,00\")&\")\",\"\")&IF(F$9>0,\" Vater:\"&IF(F18=F17,\" gekappt \",\" x \"&TEXT(F$9,\"0,0%\")),\"\")&IF(G$9>0,\" / Mutter: \"&IF(G18=G17,\" gekappt \",\" x \"&TEXT(G$9,\"0.0%\")),\"\"),\"Zahlbeträge unter Beachtung der Leistingsfähigkeit aus eigenem Einkommen:\")","v":"quotale Zahlbeträge aus Bedarf von 0,00 € Vater: gekappt  / Mutter:  gekappt "},null,null,null,{"$f":"ROUND(IFERROR(IF(F15>F17,F17,F15),\"\"),Runden2)","v":0},{"$f":"ROUND(IFERROR(IF(G15>G17,G17,G15),\"\"),Runden2)","v":0},null,null,null,"Aus dem Regelbedarf reguliert","getragen von",null,null,{"$f":"+G15+F15","v":0},null,null,"Summe Mindesbedarf",{"$f":"+Q13","v":1}]
[17,"Betreungsanteil in % eingeben (welchen prozentualen Anteil hat der Vater an der Betreuung?)",null,null,null,0.5,{"$f":"1-F19","v":0.5},null,null,null,null,"Vater","Mutter",null,null,null,null,"Mangelfall:",{"$f":"IF(S17-S18<0,1,0)","v":1}]
[18,"vom Elternteil tatsächlich getragener Anteil aus dem Regelbedarf (z.B. Essensgeld oder Kleidung)",null,null,null,{"$f":"+L20","v":0},{"$f":"+M20","v":0},null,null,"<","<<<<<<<<<<<<Betrag:",null,null,null,null,null,null,"Mangelquote"]
[19,{"$f":"\"in Natura erbrachte Leistung nach Betreuungsteilen: Vater: \"&IF(F20+G20>0,\"(\",\"\")&TEXT(F14,\"0,00\")&IF(F20>0,\" - \"&TEXT(F20,\"#.##0,00\"),\"\")&IF(G20>0,\" - \"&TEXT(G20,\"#.##0,00\")&\")\",IF(F20+G20>0,\")\",\"\"))&\" x \"&TEXT(F19,\"0%\")&IF(F20>0,\" + \"&TEXT(F20,\"#.##0,00\"),\"\")&CHAR(10)&\"................................................................................   Mutter : \"&IF(F20+G20>0,\"(\",\"\")&TEXT(F14,\"0,00\")&IF(F20>0,\" - \"&TEXT(F20,\"#.##0,00\"),\"\")&IF(G20>0,\" - \"&TEXT(G20,\"#.##0,00\")&\")\",IF(F20+G20>0,\")\",\"\"))&\" x \"&TEXT(G19,\"0%\")&IF(G20>0,\" + \"&TEXT(G20,\"#.##0,00\"),\"\")","v":"in Natura erbrachte Leistung nach Betreuungsteilen: Vater: 0,00 x 50%\n................................................................................   Mutter : 0,00 x 50%"},null,null,null,{"$f":"IF(F$4=0,0,+F19*(F14-F20-G20)+F20)","v":0},{"$f":"IF(G$4=0,0,+G19*(F14-F20-G20)+G20)","v":0},null,null,null,"Ernährungskosten, Kosten für Hobby und Freizeitgestaltung sind im Tabellenunterhaltsbedarf enthalten. Zahlt einer der Eltern solche Kosten vereinbarungsgemäß regelmäßig, wären sie hier einzutragen. Beispiel: Die im KiTa-Beitrag (modellbedingter Mehrbedarf) enthaltenen Essenskosten.",null,null,null,false,{"$f":"+G18+F18","v":0}]
[20,{"$f":"\"Vom Elternteil erbrachter Naturalunterhalt: Vater: \"&TEXT(F21,\"0,00\")&IF(F16>0,\" + \"&TEXT(F16,\"0,00\"),\"\")&IF(F20>0,\" + \"&TEXT(F20,\"#.##0,00\"),\"\")&\" / Mutter: \"&TEXT(G21,\"0,00\")&IF(G16>0,\" + \"&TEXT(G16,\"0,00\"),\"\")","v":"Vom Elternteil erbrachter Naturalunterhalt: Vater: 0,00 / Mutter: 0,00"},null,null,null,{"$f":"-F21-F16","v":0},{"$f":"-G21-G16","v":0},null,null,null,null,null,null,null,{"$f":"IF(F17<F15,1,0)","v":0},{"$f":"IF(G17<G15,1,0)","v":0}]
[21,{"$f":"IF(F23>0,\"Vom Vater an die Mutter für das Kind zu zahlender Unterhalt: \"&TEXT(F18,\"0,00\")&\" - \"&TEXT(ABS(F22),\"0,00\")&\" = \"&TEXT(F23,\"0,00 €\"),\"\")&IF(G23>0,\"Von der Mutter an den Vater für das Kind zu zahlender Unterhalt: \"&TEXT(G18,\"0,00\")&\" - \"&TEXT(ABS(G22),\"0,00\")&\" = \"&TEXT(G23,\"0,00 €\"),\"\")","v":""},null,null,null,{"$f":"+F18+F22","v":0},{"$f":"+G18+G22","v":0},null,null,null,null,null,null,null,{"$f":"+G21+F21","v":0},null,null,null,null,"BdfKlinki"]
[22,{"$f":"\"Wer erhält das Kindergeld in Höhe von \"&TEXT(2*KindergeldHälfte*-1,\"## €\")","v":"Wer erhält das Kindergeld in Höhe von  €"},null,null,null,null,null,null,null,null,null,null,null,null,{"$f":"+G18+F18","v":0},null,null,null,null,"KGKlinki"]
[23,{"$f":"IFERROR(\"Kindergeldhälfte nach Betreuungsquote auszkehren \"&IF(Q29=1,\"von V an M: \",\"von M an V: \")&\"in Höhe von: \"&TEXT(ABS(Q27+P27),\"0,00\")&\" x \"&IF(Q29=1,TEXT(G19,\"##%\"),TEXT(F19,\"##%\")),\"\")","v":"Kindergeldhälfte nach Betreuungsquote auszkehren von M an V: in Höhe von: 0,00 x 50%"},null,null,null,{"$f":"ROUND(IF(Kindergeld=1,-ABS((P27+Q27)*G19),-G25),2)","v":0},{"$f":"IF(Kindergeld=1,-F25,-ABS((P27+Q27)*F19))","v":0},null,null,null,null,null,null,null,{"$f":"+G22+F22","v":0}]
[24,{"$f":"IFERROR(\"Kindergeldhälfte ist \"&IF(Kindergeld=1,\"von V an M\",\"von M an V\")&\" nach der Anteilsquote Barunterhalt auszukehren: \"&IF(Kindergeld=1,TEXT(ABS(KindergeldHälfte),\"0,00\")&\" x \"&TEXT(ABS(G9),\"0,00%\"),TEXT(ABS(KindergeldHälfte),\"0,00\")&\" x \"&TEXT(F9,\"0,0%\")),\"\")","v":"Kindergeldhälfte ist von M an V nach der Anteilsquote Barunterhalt auszukehren: 0,00 x "},null,null,null,{"$f":"IFERROR(IF(Kindergeld=1,-ABS(KindergeldHälfte)*G9,-G26),\"\")","v":""},{"$f":"IFERROR(IF(Kindergeld=1,-F26,-ABS(KindergeldHälfte)*F9),\"\")","v":""},null,null,null,"Selbstbehalte zum nachtragen",null,null,null,null,null,{"$f":"IF(KGKlinki>0,-KGKlinki,F13)","v":0}]
[25,{"$f":"IFERROR(\"Ausgleichszahlung: \"&IF(F27>0,\"von Vater an Mutter: \"&TEXT(F23,\"#.##0,00\")&IF(Kindergeld=1,\" + \"&TEXT(ABS(F25),\"##,00\")&\" + \"&TEXT(ABS(F26),\"#0,00\"),\" - \"&TEXT(ABS(F25),\"##,00\")&\" - \"&TEXT(ABS(F26),\"#0,00\")),\"von Mutter an Vater: \"&TEXT(F23,\"#.##0,00\")&IF(Kindergeld=1,\" + \"&TEXT(ABS(F25),\"##,00\")&\" + \"&TEXT(ABS(F26),\"#0,00\"),\" - \"&TEXT(ABS(F25),\"##,00\")&\" - \"&TEXT(ABS(F26),\"#0,00\"))),\"\")","v":""},null,null,null,{"$f":"IFERROR(ROUND(+F23+G26+G25,Runden2),\"\")","v":""},{"$f":"IFERROR(ROUND(G23+F26+F25,Runden2),\"\")","v":""},null,null,null,"notwendiger SB nbt",null,null,null,null,{"$f":"IF(Q29=1,KindergeldHälfte,0)","v":0},{"$f":"IF(Q29=2,KindergeldHälfte,0)","v":0}]
[26,"Kindergeld: ",null,null,null,{"$f":"IF(Kindergeld=1,-KindergeldHälfte*2,0)","v":0},{"$f":"IF(Kindergeld=2,-KindergeldHälfte*2,0)","v":0},null,null,null,"notwendiger SB bt"]
[27,{"$f":"IFERROR(\"Liquidität Vater: \"&TEXT(F4,\"#.##0,00\")&IF(Kindergeld=1,\" + Kindergeld \"&TEXT(F28,\"#.##0,00\"),\"\")&IF(F27<0,\" + \"&TEXT(ABS(F27),\"#0,00\"),\" - \"&TEXT(ABS(F27),\"#0,00\"))&\" / \"&\"Liquidität Mutter: \"&TEXT(G4,\"#.##0,00\")&IF(Kindergeld=2,\" + Kindergeld \"&TEXT(G28,\"#0,00\"),\"\")&IF(G27<0,\" + \"&TEXT(ABS(G27),\"#0,00\"),\" - \"&TEXT(ABS(G27),\"#0,00\"))&\" : \",\"\")","v":""},null,null,null,{"$f":"IFERROR(+F4+F28-F27,\"\")","v":""},{"$f":"IFERROR(G4+G28-G27,\"\")","v":""},null,null,null,"billiger SB",null,null,null,false,"Kindergeld:",2]
[28,{"$f":"\"./. Kindesunterhalt: Vater: \"&TEXT(ABS(F22),\"#.##0,00\")&IF(F23>0,\" + \",\" - \")&TEXT(ABS(F23),\"#.##0,00\")&\" / Mutter: \"&TEXT(ABS(G22),\"#.##0,00\")&IF(G23>0,\" + \",\" - \")&TEXT(ABS(G23),\"#.##0,00\")","v":"./. Kindesunterhalt: Vater: 0,00 - 0,00 / Mutter: 0,00 - 0,00"},null,null,null,{"$f":"F22-F23","v":0},{"$f":"G22-G23","v":0},null,null,null,"angemessener SB"]
[29,{"$f":"\"anrechenbares Resteinkommen: Vater: \"&TEXT(F4,\"#.##0,00\")&\" - \"&TEXT(ABS(F30),\"#.##0,00\")&\" / Mutter: \"&TEXT(G4,\"#.##0,00\")&\" - \"&TEXT(ABS(G30),\"#.##0,00\")","v":"anrechenbares Resteinkommen: Vater: 0,00 - 0,00 / Mutter: 0,00 - 0,00"},null,null,null,{"$f":"+F4+F30","v":0},{"$f":"+G4+G30","v":0}]
[null,"II. weiteres Kind"]
[30,{"$f":"IFERROR(IF(Mangelfall=0,\"angemessener Selbstbehalt nach Düsseldorfer Tabelle \",\"notwendiger Selbstbehalt nach Düsseldorfer Tabelle \"),\"\")","v":"notwendiger Selbstbehalt nach Düsseldorfer Tabelle "},null,null,null,{"$f":"IFERROR(-VLOOKUP(Berechnungsdatum,Selbstbehalte,IF(Mangelfall=1,3,5)),\"\")","v":-1160},{"$f":"IFERROR(-VLOOKUP(Berechnungsdatum,Selbstbehalte,IF(Mangelfall=1,3,5)),\"\")","v":-1160},null,null,null,null,null,null,null,{"$f":"+G30+F30","v":0}]
[31,{"$f":"IFERROR(\"Einkommensteil zur Erfüllung von Unterhaltsansprüchen: \"&IF(F27>0,TEXT(F31,\"#.##0,00\")&\" - \"&TEXT(ABS(F33),\"#.##0,00\")&\" / \",\"\")&IF(G31>0,TEXT(G31,\"#.##0,00\")&\" - \"&TEXT(ABS(G33),\"#.##0,00\"),\"\"),\"\")","v":"Einkommensteil zur Erfüllung von Unterhaltsansprüchen: 0,00 - 1.160,00 / "},null,null,null,{"$f":"IFERROR(+F31+F33,\"\")","v":-1160},{"$f":"IFERROR(+G33+G31,\"\")","v":-1160}]
[32,{"$f":"\"Anteilsquote mit der der Bedarf zu erfüllen ist: \"&IF(F34>0,\"V: \"&TEXT(F34,\"#.##0,00\")&\"/(\"&TEXT(F34,\"#.##0,00\")&\" + \"&TEXT(G34,\"#.##0,00\")&\")\",\"\")&CHAR(10)&IF(G34>0,\"...................................................................M: \"&TEXT(G34,\"#.##0,00\")&\"/(\"&TEXT(G34,\"#.##0,00\")&\" + \"&TEXT(F34,\"#.##0,00\")&\")\",\"\")","v":"Anteilsquote mit der der Bedarf zu erfüllen ist: \n"},null,null,null,{"$f":"+F9","v":""},{"$f":"+G9","v":""},null,null,null,"modellbedingter Mehrbedarf","getragen von:"]
[33,null,null,null,"Geburtstagi","Tabellenbedarf",null,null,null,null,null,"Vater","Mutter"]
[34,null,null,null,null,{"$f":"IF(E37=\"\",0,VLOOKUP(T10,IF(YEAR(Berechnungsdatum)<2021,DDorf20,DDorf21),P10+2))","v":0},null,null,null,null,{"$f":"IF(Wohnbedarfsreduktion,\"Wohnmehrkosten 20%\",\"\")","v":""},{"$f":"IF(L38>0,0,IF(Wohnbedarfsreduktion,F38*0.2,\"\"))","v":""},{"$f":"IF(M38>0,0,IF(Wohnbedarfsreduktion,F38*0.2,\"\"))","v":""}]
[35,{"$f":"IFERROR(B37&IF(B37<>\"\",\": \",\"\")&\"Bedarf aus zusammengerechnetem Einkommen nach Düsseldorfer Tabelle \"&IF(Mangelfall=1,\"Mangelfall\",\"\"),\"\")","v":"Bedarf aus zusammengerechnetem Einkommen nach Düsseldorfer Tabelle Mangelfall"},null,null,null,{"$f":"IF(E37=0,0,IF(Mangelfall=0,F37,VLOOKUP(1,IF(YEAR(Berechnungsdatum)<2021,DDorferTab20,DDorf21),P10+2)))","v":0},null,null,null,null,"Wohnkosten:"]
[36,null,null,null,null,null,null,null,null,null,"Fahrtkosten:"]
[37,"Barbedarfsanteil des Kindergeldes wird im Rahmen der Kindergeldverteilung berücksichtigt",null,null,null,{"$f":"IF(E37=\"\",0,-VLOOKUP(Berechnungsdatum,Kindergeldtabelle,3)/2)","v":0},null,null,null,null,"Betreuungskosten:"]
[38,{"$f":"+B$14","v":"Regelbarbedarf nach Düsseldorfer Tabelle "},null,null,null,{"$f":"(F38)*F$10*IF(Wohnbedarfsreduktion,0.8,1)+F40","v":0},null,null,null,null,"Bekleidung:"]
[39,"Barbedarfsanteile",null,null,null,{"$f":"IFERROR(F41*F35,0)","v":0},{"$f":"IFERROR(F41*G35,0)","v":0},null,null,null,"Sonstiges:"]
[40,"Wohn- und sonstiger Mehrbedarf für das Kind eingeben",null,null,null,{"$f":"+L43","v":0},{"$f":"+M43","v":0},null,null,null,{"$f":"\"<<<<<<<<<<Summe: \"&TEXT(L43+M43,\"#.##0,00\")","v":"<<<<<<<<<<Summe: 0,00"},{"$f":"SUM(L37:L42)","v":0},{"$f":"SUM(M37:M42)","v":0}]
[41,{"$f":"\"Begrenzung nach Einkommen Vater: \"&IF(R$9>0,TEXT(R$9,\"0,00\")&\" - \"&TEXT(ABS(F40),\"0,00\")&IF(F43>0,\" + \"&TEXT(F43+G43,\"0,00\")&\" x \"&TEXT(F$9,\"0%\"),\"\"),\"\")&IF(S$9>0,\" / Mutter: \"&TEXT(S$9,\"0,00\")&\" - \"&TEXT(ABS(F40),\"0,00\")&IF(F43+G43>0,\" + \"&TEXT(G43+F43,\"0,00\")&\" x \"&TEXT(G$9,\"0%\"),\"\"),\"\")","v":"Begrenzung nach Einkommen Vater: "},null,null,null,{"$f":"IF(F$4=0,0,VLOOKUP(F$4,IF(YEAR(Berechnungsdatum)<2018,DDorferTab17,DDorferTab18),P$10+1)+F40+(F43+G43)*F$9)","v":0},{"$f":"IF(S$9>0,VLOOKUP(G$4,IF(YEAR(Berechnungsdatum)<2018,DDorferTab17,DDorferTab18),P$10+1)+F40+(F43+G43)*G$9,0)","v":0}]
[42,{"$f":"IFERROR(IF(O46+P46=0,\"quotale Zahlbeträge aus Bedarf (\"&TEXT(F41,\"0,00\")&\" + \"&TEXT(F43+G43,\"0,00\")&\")\"&IF(F35>0,\" Vater:\"&IF(F45=F44,\" gekappt \",\" x \"&TEXT(F35,\"0,0%\")),\"\")&IF(G35>0,\" / Mutter: \"&IF(G45=G44,\" gekappt \",\" x \"&TEXT(G35,\"0,0%\")),\"\"),\"Zahlbeträge unter Beachtung der Leistingsfähigkeit aus eigenem Einkommen:\"),\"\")","v":"quotale Zahlbeträge aus Bedarf (0,00 + 0,00) Vater: x  / Mutter:  x "},null,null,null,{"$f":"IFERROR(ROUND((F41+F43+G43)*F$35,Runden2),\"\")","v":""},{"$f":"IFERROR(ROUND((F41+F43+G43)*G$35,Runden2),\"\")","v":""},null,null,null,"Aus dem Regelbedarf ","getragen von"]
[43,"Betreungsanteil in % eingeben (welchen prozentualen Anteil hat der Vater an der Betreuung?)",null,null,null,null,{"$f":"1-F46","v":1},null,null,null,null,"Vater","Mutter",null,{"$f":"IF(F44<F42,1,0)","v":0},{"$f":"IF(G44<G42,1,0)","v":0}]
[44,"vom Elternteil tatsächlich getragener Anteil aus dem Regelbedarf (z.B. Essensgeld in Kita oder Schule)",null,null,null,{"$f":"+L47","v":160},{"$f":"+M47","v":60},null,null,null,"<<<<<<<<<<<<<<<<Betrag:",160,60,null,{"$f":"+G45+F45+E43","v":{"$error":"#VALUE!"}}]
[45,{"$f":"\"Verteilung des Regel-Bedarfs nach Betreuungsanteilen: \"&TEXT(F41,\"0,00\")&\" Vater x \"&TEXT(F46,\"0%\")& \" / Mutter x : \"&TEXT(G46,\"0%\")","v":"Verteilung des Regel-Bedarfs nach Betreuungsanteilen: 0,00 Vater x 0% / Mutter x : 100%"},null,null,null,{"$f":"IF(F$4=0,0,+F46*(F41-L47-M47)+F47)","v":0},{"$f":"IF(G$4=0,0,+G46*(F41-L47-M47)+G47)","v":0},null,null,null,null,null,null,null,{"$f":"+G45+F45","v":{"$error":"#VALUE!"}}]
[46,{"$f":"\"Vom Elternteil erbrachter Naturalunterhalt: Vater: \"&TEXT(F48,\"0,00\")&IF(F43>0,\" + \"&TEXT(F43,\"0,00\"),\"\")&\" / Mutter: \"&TEXT(G48,\"0,00\")&IF(G43>0,\" + \"&TEXT(G43,\"0,00\"),\"\")","v":"Vom Elternteil erbrachter Naturalunterhalt: Vater: 0,00 / Mutter: 0,00"},null,null,null,{"$f":"-F48-F43","v":0},{"$f":"-G48-G43","v":0}]
[47,{"$f":"IFERROR(IF(F50>0,\"Vom Vater an die Mutter für das Kind zu zahlender Unterhalt: \"&TEXT(F45,\"0,00\")&\" - \"&TEXT(ABS(F49),\"0,00\")&\" = \"&TEXT(F50,\"0,00 €\"),\"\")&IF(G50>0,\"Von der Mutter an den Vater für das Kind zu zahlender Unterhalt: \"&TEXT(G45,\"0,00\")&\" - \"&TEXT(ABS(G49),\"0,00\")&\" = \"&TEXT(G50,\"0,00 €\"),\"\"),\"\")","v":"Vom Vater an die Mutter für das Kind zu zahlender Unterhalt:  - 0,00 = Von der Mutter an den Vater für das Kind zu zahlender Unterhalt:  - 0,00 = "},null,null,null,{"$f":"IFERROR(+F45+F49,\"\")","v":""},{"$f":"IFERROR(+G45+G49,\"\")","v":""},null,null,null,null,null,null,null,null,null,{"$f":"+F40","v":0}]
[48,"Wer erhält das Kindergeld?",null,null,null,null,null,null,null,null,null,null,null,null,null,{"$f":"IF(Q53=1,KindergeldHälfte,0)","v":0},{"$f":"IF(Q53=2,KindergeldHälfte,0)","v":0}]
[49,{"$f":"\"Kindergeldhälfte ist nach Betreuungsquote auszukehren \"&IF(Kindergeld_2=1,\"von Vater an Mutter: \",\"von Mutter an Vater: \")&\"in Höhe von: \"&TEXT(ABS(Q51+P51),\"0,00\")&\" x \"&IF(Kindergeld_2=1,TEXT(G46,\"##%\"),TEXT(F46,\"##%\"))","v":"Kindergeldhälfte ist nach Betreuungsquote auszukehren von Vater an Mutter: in Höhe von: 0,00 x 100%"},null,null,null,{"$f":"IF(E37=\"\",0,ROUND(IF(Kindergeld_2=1,-ABS((P51+Q51)*G46),-G52),2))","v":0},{"$f":"IF(E37=\"\",0,IF(Kindergeld_2=1,-F52,-ABS((P51+Q51)*F46)))","v":0}]
[50,{"$f":"IFERROR(\"Kindergeldhälfte ist \"&IF(Kindergeld_2=1,\"von V an M\",\"von M an V\")&\" nach der Anteilsquote Barunterhalt auszukehren: \"&IF(Kindergeld_2=1,TEXT(ABS(Kindergeldhälfte_2),\"0,00\")&\" x \"&TEXT(ABS(G35),\"0,00%\"),TEXT(ABS(Kindergeldhälfte_2),\"0,00\")&\" x \"&TEXT(F35,\"0,0%\")),\"\")","v":""},null,null,null,{"$f":"IF(Geburtstag2=\"\",0,IF(Kindergeld_2=1,-ABS(Kindergeldhälfte_2)*G35,-G53))","v":0},{"$f":"IF(Geburtstag2=\"\",0,IF(Kindergeld_2=1,-F53,-ABS(Kindergeldhälfte_2)*F35))","v":0},null,null,null,null,null,null,null,null,"Kindergeld_2",1]
[51,{"$f":"IFERROR(\"Ausgleichszahlung: \"&IF(F54>0,\"von Vater an Mutter: \"&TEXT(F50,\"#.##0,00\")&IF(Kindergeld=1,\" + \"&TEXT(ABS(F52),\"##,00\")&\" + \"&TEXT(ABS(F53),\"#0,00\"),\" - \"&TEXT(ABS(F52),\"##,00\")&\" - \"&TEXT(ABS(F53),\"#0,00\")),\"von Mutter an Vater: \"&TEXT(F50,\"#.##0,00\")&IF(Kindergeld=1,\" + \"&TEXT(ABS(F52),\"##,00\")&\" + \"&TEXT(ABS(F53),\"#0,00\"),\" - \"&TEXT(ABS(F52),\"##,00\")&\" - \"&TEXT(ABS(F53),\"#0,00\"))),\"\")","v":"Ausgleichszahlung: von Vater an Mutter:  - ,00 - 0,00"},null,null,null,{"$f":"IFERROR(ROUNDUP(+F50+G53+G52,Runden2),\"\")","v":""},{"$f":"IFERROR(ROUNDUP(+G50+H53+H52,Runden2),\"\")","v":""}]
[52,"Kindergeld: ",null,null,null,{"$f":"IF(Geburtstag2=\"\",0,IF(Kindergeld_2=1,-Kindergeldhälfte_2*2,0))","v":0},{"$f":"IF(Geburtstag2=\"\",0,IF(Kindergeld_2=2,-Kindergeldhälfte_2*2,0))","v":0}]
[53,{"$f":"\"Liquidität Vater: \"&TEXT(F31,\"#.##0,00\")&IF(Kindergeld_2=1,\" + Kindergeld \"&TEXT(F55,\"#.##0,00\"),\"\")&IF(F54>0,\" - \"&TEXT(F54,\"#0,00\"),\" + \"&TEXT(ABS(F54),\"#0,00\"))&\" / \"&\"Liquidität Mutter: \"&TEXT(G31,\"#.##0,00\")&IF(Kindergeld_2=2,\" + Kindergeld \"&TEXT(G55,\"#0,00\"),\"\")&IF(G54>0,\" - \"&TEXT(G54,\"#0,00\"),\" + \"&TEXT(ABS(G54),\"#0,00\"))&\" : \"","v":"Liquidität Vater: 0,00 + Kindergeld 0,00 -  / Liquidität Mutter: 0,00 -  : "},null,null,null,{"$f":"IF(Geburtstag2=\"\",0,F31+F55-F54)","v":0},{"$f":"IF(Geburtstag2=\"\",0,G31+G55-G54)","v":0}]
[54,{"$f":"IFERROR(\"./. Kindesunterhalt: Vater: \"&TEXT(ABS(F49),\"#.##0,00\")&IF(F50>0,\" + \",\" - \")&TEXT(ABS(F50),\"#.##0,00\")&\" / Mutter: \"&TEXT(ABS(G49),\"#.##0,00\")&IF(G50>0,\" + \",\" - \")&TEXT(ABS(G50),\"#.##0,00\"),\"\")","v":""},null,null,null,{"$f":"IFERROR(F49-F50,\"\")","v":""},{"$f":"IFERROR(G49-G50,\"\")","v":""}]
[55,{"$f":"IFERROR(\"anrechenbares Resteinkommen: Vater: \"&TEXT(F31,\"#.##0,00\")&\" - \"&TEXT(ABS(F57),\"#.##0,00\")&\" / Mutter: \"&TEXT(G31,\"#.##0,00\")&\" - \"&TEXT(ABS(G57),\"#.##0,00\"),\"\")","v":""},null,null,null,{"$f":"IF(Geburtstag2=\"\",0,F31+F57)","v":0},{"$f":"IF(Geburtstag2=\"\",0,G31+G57)","v":0}]
[56,"III. weiteres Kind"]
[57,{"$f":"IFERROR(IF(Mangelfall=0,\"angemessener Selbstbehalt nach Düsseldorfer Tabelle \",\"notwendiger Selbstbehalt nach Düsseldorfer Tabelle \"),\"\")","v":"notwendiger Selbstbehalt nach Düsseldorfer Tabelle "},null,null,null,{"$f":"IFERROR(-VLOOKUP(Berechnungsdatum,Selbstbehalte,IF(Mangelfall=1,3,5)),\"\")","v":-1160},{"$f":"IFERROR(-VLOOKUP(Berechnungsdatum,Selbstbehalte,IF(Mangelfall=1,3,5)),\"\")","v":-1160}]
[58,{"$f":"\"Einkommensteil zur Erfüllung von Unterhaltsansprüchen: Vater: \"&IF(F58>0,TEXT(F58,\"#.##0,00\")&\" - \"&TEXT(ABS(F60),\"#.##0,00\"),\"\")&\" / Mutter: \"&IF(G58>0,TEXT(G58,\"#.##0,00\")&\" - \"&TEXT(ABS(G60),\"#.##0,00\"),\"\")","v":"Einkommensteil zur Erfüllung von Unterhaltsansprüchen: Vater:  / Mutter: "},null,null,null,{"$f":"IFERROR(+F58+F60,\"\")","v":-1160},{"$f":"IFERROR(+G60+G58,\"\")","v":-1160},null,null,null,"modellbedingter Mehrbedarf","getragen von:"]
[59,{"$f":"\"Anteilsquote mit der der Bedarf zu erfüllen ist: \"&IF(F61>0,\"V: \"&TEXT(F61,\"#.##0,00\")&\"/(\"&TEXT(F61,\"#.##0,00\")&\" + \"&TEXT(G61,\"#.##0,00\")&\")\",\"\")&IF(G61>0,\"; M: \"&TEXT(G61,\"#.##0,00\")&\"/(\"&TEXT(G61,\"#.##0,00\")&\" + \"&TEXT(F61,\"#.##0,00\")&\")\",\"\")","v":"Anteilsquote mit der der Bedarf zu erfüllen ist: "},null,null,null,{"$f":"+F9","v":""},{"$f":"+G9","v":""},null,null,null,null,"Vater","Mutter"]
[60,null,null,null,"Geburtstagi","Tabellenbedarf",null,null,null,null,{"$f":"IF(Wohnbedarfsreduktion,\"Wohnmehrkosten 20%\",\"\")","v":""},{"$f":"IF(L64>0,0,IF(Wohnbedarfsreduktion,F64*0.2,\"\"))","v":""},{"$f":"IF(M64>0,0,IF(Wohnbedarfsreduktion,F64*0.2,\"\"))","v":""}]
[61,null,null,null,null,{"$f":"IF(E64=\"\",0,VLOOKUP(T12,IF(YEAR(Berechnungsdatum)<2021,DDorf20,DDorf21),P12+2))","v":0},null,null,null,null,"Wohnkosten:"]
[62,{"$f":"B64&IF(B25<>\"\",\": \",\"\")&\"Bedarf aus zusammengerechnetem Einkommen nach Düsseldorfer Tabelle \"&P65&IF(Mangelfall=1,\"Mangelfall\",\"\")","v":": Bedarf aus zusammengerechnetem Einkommen nach Düsseldorfer Tabelle Mangelfall"},null,null,null,{"$f":"IF(E64=0,0,IF(Mangelfall=0,F64,VLOOKUP(1,IF(YEAR(Berechnungsdatum)<2021,DDorferTab20,DDorf21),P11+2)))","v":0},null,null,null,null,"Fahrtkosten:",null,null,null,null,{"$f":"IF(E64=\"\",\"\",\"Altersst.: \"&TEXT(P12,\"0\"))","v":""}]
[63,{"$f":"+B40","v":"Barbedarfsanteil des Kindergeldes wird im Rahmen der Kindergeldverteilung berücksichtigt"},null,null,null,{"$f":"IF(E64=\"\",0,-VLOOKUP(Berechnungsdatum,Kindergeldtabelle,4)/2)","v":0},null,null,null,null,"Betreuungskosten:"]
[64,{"$f":"+B$14","v":"Regelbarbedarf nach Düsseldorfer Tabelle "},null,null,null,{"$f":"(F65+F66)*F$10*IF(Wohnbedarfsreduktion,0.8,1)","v":0},null,null,null,null,"Bekleidung:",null,null,null,"Offen lassen"]
[65,"Barbedarfsanteile",null,null,null,{"$f":"IFERROR(F67*F62,0)","v":0},{"$f":"IFERROR(F67*G62,0)","v":0},null,null,null,"Sonstiges:"]
[66,"Wohn- und sonstiger Mehrbedarf für das Kind eingeben",null,null,null,{"$f":"+L69","v":0},{"$f":"+M69","v":0},null,null,null,{"$f":"\"<<<<<<<<<<Summe: \"&TEXT(L69+M69,\"#.##0,00\")","v":"<<<<<<<<<<Summe: 0,00"},{"$f":"SUM(L63:L68)","v":0},{"$f":"SUM(M63:M68)","v":0}]
[67,{"$f":"\"Begrenzung nach Einkommen Vater: \"&IF(R$9>0,TEXT(R$9,\"0,00\")&\" - \"&TEXT(ABS(F66),\"0,00\")&IF(F69>0,\" + \"&TEXT(F69+G69,\"0,00\")&\" x \"&TEXT(F$9,\"0%\"),\"\"),\"\")&IF(S$9>0,\" / Mutter: \"&TEXT(S$9,\"0,00\")&\" - \"&TEXT(ABS(F66),\"0,00\")&IF(F69+G69>0,\" + \"&TEXT(G69+F69,\"0,00\")&\" x \"&TEXT(G$9,\"0%\"),\"\"),\"\")","v":"Begrenzung nach Einkommen Vater: "},null,null,null,{"$f":"IF(F58=0,0,VLOOKUP(F58,IF(YEAR(Berechnungsdatum)<2018,DDorferTab17,DDorferTab18),P$12+1)+F66+(F69+G69)*F62)","v":0},{"$f":"IF(S$12>0,VLOOKUP(G58,IF(YEAR(Berechnungsdatum)<2018,DDorferTab17,DDorferTab18),P$12+1)+F66+(F69+G69)*G62,0)","v":0}]
[68,{"$f":"IFERROR(IF(O72+P72=0,\"quotal berechnete Zahlbeträge aus Gesamtbedarf (\"&TEXT(F67,\"0,00\")&\" + \"&TEXT(F69+G69,\"0,00\")&\")\"&IF(F62>0,\" Vater:\"&IF(F71=F70,\" gekappt \",\" x \"&TEXT(F62,\"0,0%\")),\"\")&IF(G62>0,\" / Mutter: \"&IF(G71=G70,\" gekappt \",\" x \"&TEXT(G62,\"0,0%\")),\"\"),\"Zahlbeträge unter Beachtung der Leistingsfähigkeit aus eigenem Einkommen:\"),\"\")","v":"quotal berechnete Zahlbeträge aus Gesamtbedarf (0,00 + 0,00) Vater: x  / Mutter:  x "},null,null,null,{"$f":"IFERROR(ROUND((F67+F69+G69)*F62,Runden2),\"\")","v":""},{"$f":"IFERROR(ROUND((F67+F69+G69)*G62,Runden2),\"\")","v":""},null,null,null,"Aus dem Regelbedarf ","getragen von"]
[69,"Betreungsanteil in % eingeben (welchen prozentualen Anteil hat der Vater an der Betreuung?)",null,null,null,null,{"$f":"1-F72","v":1},null,null,null,null,"Vater","Mutter"]
[70,"vom Elternteil tatsächlich getragener Anteil aus dem Regelbedarf (z.B. Essensgeld in Kita oder Schule)",null,null,null,{"$f":"+L73","v":0},{"$f":"+M73","v":0},null,null,null,"<<<<<<<<<<<<<<<<Betrag:"]
[71,{"$f":"\"Verteilung des Regel- Bedarfs nach Betreuungsanteilen: \"&TEXT(F67,\"0,00\")&\" Vater x \"&TEXT(F72,\"0%\")& \" / Mutter x : \"&TEXT(G72,\"0%\")","v":"Verteilung des Regel- Bedarfs nach Betreuungsanteilen: 0,00 Vater x 0% / Mutter x : 100%"},null,null,null,{"$f":"IF(F$4=0,0,+F72*(F67-L73-M73)+F73)","v":0},{"$f":"IF(G$4=0,0,+G72*(F67-L73-M73)+G73)","v":0}]
[72,{"$f":"\"Vom Elternteil erbrachter Naturalunterhalt: Vater: \"&TEXT(F74,\"0,00\")&IF(F69>0,\" + \"&TEXT(F69,\"0,00\"),\"\")&\" / Mutter: \"&TEXT(G74,\"0,00\")&IF(G69>0,\" + \"&TEXT(G69,\"0,00\"),\"\")","v":"Vom Elternteil erbrachter Naturalunterhalt: Vater: 0,00 / Mutter: 0,00"},null,null,null,{"$f":"-F74-F69","v":0},{"$f":"-G74-G69","v":0}]
[73,{"$f":"IFERROR(IF(F76>0,\"Vom Vater an die Mutter für das Kind zu zahlender Unterhalt: \"&TEXT(F71,\"0,00\")&\" - \"&TEXT(ABS(F75),\"0,00\")&\" = \"&TEXT(F76,\"0,00 €\"),\"\")&IF(G76>0,\"Von der Mutter an den Vater für das Kind zu zahlender Unterhalt: \"&TEXT(G71,\"0,00\")&\" - \"&TEXT(ABS(G75),\"0,00\")&\" = \"&TEXT(G76,\"0,00 €\"),\"\"),\"\")","v":"Vom Vater an die Mutter für das Kind zu zahlender Unterhalt:  - 0,00 = Von der Mutter an den Vater für das Kind zu zahlender Unterhalt:  - 0,00 = "},null,null,null,{"$f":"IFERROR(+F71+F75,\"\")","v":""},{"$f":"IFERROR(+G71+G75,\"\")","v":""},null,null,null,null,null,null,null,null,null,{"$f":"+F66","v":0}]
[74,"Wer erhält das Kindergeld?",null,null,null,null,null,null,null,null,null,null,null,null,null,{"$f":"IF(P79=1,Kindergeldhälfte_3,0)","v":0},{"$f":"IF(P79=2,Kindergeldhälfte_3,0)","v":0}]
[75,{"$f":"\"Kindergeld ist nach Betreuungsquote auszukehren \"&IF(Kindergeld_3=1,\"von Vater an Mutter: \",\"von Mutter an Vater: \")&\"in Höhe von: \"&TEXT(ABS(Q77+P77),\"0,00\")&\" x \"&IF(Q79=1,TEXT(G72,\"##%\"),TEXT(F72,\"##%\"))","v":"Kindergeld ist nach Betreuungsquote auszukehren von Vater an Mutter: in Höhe von: 0,00 x %"},null,null,null,{"$f":"IF(Geburtstag3=\"\",0,ROUND(IF(Kindergeld_3=1,-ABS((P77+Q77)*G72),-G78),2))","v":0},{"$f":"IF(Geburtstag3=\"\",0,IF(Kindergeld_3=1,-F78,-ABS((P77+Q77)*F72)))","v":0}]
[76,{"$f":"IFERROR(\"Kindergeldhälfte ist \"&IF(Kindergeld_3=1,\"vom Vater an die Mutter\",\"von der Mutter an den Vater\")&\" nach der Anteilsquote Barunterhalt auszukehren: \"&IF(Kindergeld_3=1,TEXT(ABS(Kindergeldhälfte_3),\"0,00\")&\" x \"&TEXT(ABS(G62),\"0,00%\"),TEXT(ABS(Kindergeldhälfte_3),\"0,00\")&\" x \"&TEXT(F62,\"0,0%\")),\"\")","v":""},null,null,null,{"$f":"IF(Geburtstag3=\"\",0,IFERROR(ROUND(IF(Kindergeld_3=1,-ABS(Kindergeldhälfte_3)*G62,-G79),2),0))","v":0},{"$f":"IF(Geburtstag3=\"\",0,IF(Kindergeld_3=1,-F79,-ABS(Kindergeldhälfte_3)*F62))","v":0},null,null,null,null,null,null,null,"Kindergeld_3",1]
[77,{"$f":"IFERROR(\"Ausgleichszahlung: \"&IF(G80<0,\"von Mutter an Vater: \"&IF(G76>0,TEXT(G76,\"#.##0,00\")&\" + \",\"\")&TEXT(ABS(G78),\"#.##0,00\")&\" + \"&TEXT(ABS(G79),\"#.##0,00\"),\"von Vater an Mutter: \"&IF(F76>0,TEXT(F76,\"#.##0,00\")&\" + \",\"\")&TEXT(ABS(F78),\"#.##0,00\")&\" + \"&TEXT(ABS(F79),\"#.##0,00\")&\" - \"&TEXT(ABS(G76),\"#.##0,00\")),\"\")","v":""},null,null,null,{"$f":"IF(Geburtstag3=\"\",0,ROUNDUP(F76+F78+F79,0))","v":0},{"$f":"-F80","v":0}]
[78,"Kindergeld: ",null,null,null,{"$f":"IF(Kindergeld_3=1,-Kindergeldhälfte_3*2,0)","v":0},{"$f":"IF(Kindergeld_3=2,-Kindergeldhälfte_3*2,0)","v":0}]
[79,{"$f":"\"Liquidität Vater: \"&TEXT(F58,\"#.##0,00\")&IF(Kindergeld_3=1,\" + Kindergeld \"&TEXT(F81,\"#.##0,00\"),\"\")&IF(F80>0,\" - \"&TEXT(F80,\"#0,00\"),\" + \"&TEXT(ABS(F80),\"#0,00\"))&\" / \"&\"Liquidität Mutter: \"&TEXT(G58,\"#.##0,00\")&IF(Kindergeld_3=2,\" + Kindergeld: \"&TEXT(G81,\"#0,00\"),\"\")&IF(G80>0,\" - \"&TEXT(G80,\"#0,00\"),\" + \"&TEXT(ABS(G80+G55),\"#0,00\"))&\" : \"","v":"Liquidität Vater: 0,00 + Kindergeld 0,00 + 0,00 / Liquidität Mutter: 0,00 + 0,00 : "},null,null,null,{"$f":"IF(E64=\"\",0,F58+F81-F80)","v":0},{"$f":"IF(E64=\"\",0,G58+G81-G80)","v":0}]
[80,{"$f":"IFERROR(\"./. Kindesunterhalt: Vater: \"&TEXT(ABS(F75),\"#.##0,00\")&IF(F76>0,\" + \",\" - \")&TEXT(ABS(F76),\"#.##0,00\")&\" / Mutter: \"&TEXT(ABS(G75),\"#.##0,00\")&IF(G76>0,\" + \",\" - \")&TEXT(ABS(G76),\"#.##0,00\"),\"\")","v":""},null,null,null,{"$f":"IFERROR(F75-F76,\"\")","v":""},{"$f":"IFERROR(G75-G76,\"\")","v":""},null,null,null,null,null,null,null,{"$f":"+F82-G82","v":0}]
[81,{"$f":"IFERROR(\"anrechenbares Resteinkommen: Vater: \"&TEXT(F58,\"#.##0,00\")&IF(Kindergeld_3=1,\" + \"&TEXT(F81,\"#.##0,00\"),\"\")&\" - \"&TEXT(ABS(F83),\"#.##0,00\")&\" / Mutter: \"&TEXT(G58,\"#.##0,00\")&\" - \"&TEXT(ABS(G83),\"#.##0,00\")&IF(Kindergeld_3=2,\" + \"&TEXT(G81,\"#.##0,00\"),\"\"),\"\")","v":""},null,null,null,{"$f":"IFERROR(+F58+F83,\"\")","v":""},{"$f":"IFERROR(+G58+G83,\"\")","v":""}]

{"sheet":"DDorfer","index":2,"n_rows":104,"n_cols":16,"rows_kept":104,"cut":false,"hidden":true,"merged":[[88,1,88,2],[88,6,88,7],[85,0,85,7],[86,0,87,0],[86,1,87,1],[86,2,87,2],[86,3,86,6],[16,1,16,2],[16,6,16,7],[13,0,13,7],[14,0,15,0],[14,1,15,1],[14,2,15,2],[14,3,14,6],[37,6,37,7],[51,0,51,7],[52,0,53,0],[52,1,53,1],[52,2,53,2],[52,3,52,6],[71,1,71,2],[71,6,71,7],[27,11,27,15],[68,0,68,7],[69,0,70,0],[69,1,70,1],[69,2,70,2],[69,3,69,6],[54,1,54,2],[54,6,54,7],[34,0,34,7],[35,0,36,0],[35,1,36,1],[35,2,36,2],[35,3,35,6],[37,1,37,2]]}
[0,null,"Altersstufen, bis Alter",null,null,null,"Bedarfs-kontroll-betrag","Stufe","%"]
[null,null,5,11,17,">17"]
[1,0,342,393,460,527,"880/1080",1,1]
[2,1501,360,413,483,554,1180,2,1.05]
[3,1901,377,433,506,580,1280,3,1.1000000000000001]
[4,2301,394,452,529,607,1380,4,1.1499999999999999]
[5,2701,411,472,552,633,1480,5,1.2]
[6,3101,438,504,589,675,1580,6,1.28]
[7,3501,466,535,626,717,1680,7,1.36]
[8,3901,493,566,663,759,1780,8,1.44]
[9,4301,520,598,700,802,1880,9,1.52]
[10,4701,548,629,736,844,1980,10,1.6]
[]
["Düsseldorfer Tabelle 2018",null,null,null,null,null,null,null,null,null,1]
["Differenz","Einkommens-stufe","Einkommen bis","Altersstufen, Alter bis",null,null,null,null,null,null,1.05]
[null,null,null,5,11,17,18,"%",null,null,1.1000000000000001]
[null,"§ 1612a Abs. 1 BGB in %",null,0.87,1,1.17,null,null,null,null,1.1499999999999999]
[null,1,0,347,399,467,535,1,1,null,1.2]
[400,{"$f":"+B18+1","v":2},1901,365,419,491,563,1.0508999999999999,2,null,1.28]
[{"$f":"+A19","v":400},{"$f":"+B19+1","v":3},{"$f":"+C19+A20","v":2301},382,440,515,590,1.1017999999999999,3,null,1.36]
[{"$f":"+A20","v":400},4,2701,399,459,537,615,1.1500999999999999,4,null,1.44]
[400,5,3101,417,479,561,643,1.2010000000000001,5,null,1.52]
[400,6,3501,445,512,599,686,1.2824,6,null,1.6]
[400,7,3901,472,543,636,729,1.3613,7]
[400,8,4301,500,575,673,771,1.4401999999999999,8]
[400,9,4701,528,607,711,815,1.5216000000000001,9]
[400,10,5101,555,639,747,855,1.6005,10]
[null,null,null,null,null,null,null,null,null,null,null,"Kindergeldtabelle"]
[null,null,null,null,null,null,null,null,null,null,null,null,"1.","2.","3.","4."]
[null,null,"Runden",6,null,null,null,null,null,null,null,"2018-01-01",194,194,200,225]
[null,null,null,null,null,null,null,null,null,null,null,"2019-07-01",204,204,210,235]
[null,null,null,null,null,null,null,null,null,null,null,"2020-01-01",204,204,210,235]
[null,null,null,null,null,null,null,null,null,null,null,"2021-01-01",219,219,225,250]
[null,null,null,null,null,null,null,null,null,null,null,"2022-01-01",219,219,225,250]
["Düsseldorfer Tabelle 2019"]
["Differenz","Einkommens-stufe","Einkommen bis","Altersstufen, Alter bis"]
[null,null,null,5,11,17,18,"%"]
[null,"§ 1612a Abs. 1 BGB in %",null,0.87,1,1.17,null,null,null,null,null,"Selbstbehalt"]
[null,1,0,354,406,476,527,1,1,null,null,"2019-01-01",880,1080,1200,1300]
[400,{"$f":"+B39+1","v":2},1901,372,427,500,554,1.0508999999999999,2,null,null,"2020-01-01",{"$f":"+Berechnungsschema!L27","v":0},1160,1280,1400]
[{"$f":"+A40","v":400},{"$f":"+B40+1","v":3},{"$f":"+C40+A41","v":2301},390,447,524,580,1.1017999999999999,3,null,null,"2021-01-01",960,1160,1280,1400]
[{"$f":"+A41","v":400},4,2701,408,467,548,607,1.1500999999999999,4,null,null,"2022-01-01",960,1160,1280,1400]
[400,5,3101,425,488,572,633,1.2010000000000001,5]
[400,6,3501,454,520,610,675,1.2824,6]
[400,7,3901,482,553,648,717,1.3613,7]
[400,8,4301,510,585,686,759,1.4401999999999999,8]
[400,9,4701,539,618,724,802,1.5216000000000001,9]
[400,10,5101,567,650,762,844,1.6005,10]
[]
[]
[]
["Düsseldorfer Tabelle 2020"]
["Differenz","Einkommens-stufe","Einkommen bis","Altersstufen, Alter bis"]
[null,null,null,5,11,17,18,"%"]
[null,"§ 1612a Abs. 1 BGB in %",null,0.87,1,1.17]
[null,1,0,369,424,497,530,1,1]
[400,{"$f":"+B56+1","v":2},1901,388,446,522,557,1.0508999999999999,2]
[{"$f":"+A57","v":400},{"$f":"+B57+1","v":3},{"$f":"+C57+A58","v":2301},406,467,547,583,1.1017999999999999,3]
[{"$f":"+A58","v":400},4,2701,425,488,572,610,1.1500999999999999,4]
[400,5,3101,443,509,597,636,1.2010000000000001,5]
[400,6,3501,473,543,637,679,1.2824,6]
[400,7,3901,502,577,676,721,1.3613,7]
[400,8,4301,532,611,716,764,1.4401999999999999,8]
[400,9,4701,561,645,756,806,1.5216000000000001,9]
[400,10,5101,591,679,796,848,1.6005,10]
[]
[]
[]
["Düsseldorfer Tabelle 2021"]
["Differenz","Einkommens-stufe","Einkommen ab","Altersstufen, Alter bis"]
[null,null,null,5,11,17,18,"%"]
[null,"§ 1612a Abs. 1 BGB in %",null,0.87,1,1.17]
[null,1,0,393,451,528,564,1,1,null,2000]
[400,{"$f":"+B73+1","v":2},1901,413,474,555,593,1.0508999999999999,2,null,{"$f":"VLOOKUP(K73,C73:G82,3)","v":474}]
[{"$f":"+A74","v":400},{"$f":"+B74+1","v":3},{"$f":"+C74+A75","v":2301},433,497,581,621,1.1017999999999999,3]
[{"$f":"+A75","v":400},4,2701,452,519,608,649,1.1500999999999999,4]
[400,5,3101,472,542,634,677,1.2010000000000001,5]
[400,6,3501,504,578,676,722,1.2824,6]
[400,7,3901,535,614,719,768,1.3613,7]
[400,8,4301,566,650,761,813,1.4401999999999999,8]
[400,9,4701,598,686,803,858,1.5216000000000001,9]
[400,10,5101,629,722,845,903,1.6005,10]
[]
[]
[]
["Düsseldorfer Tabelle 2022"]
["Differenz","Einkommens-stufe","Einkommen ab","Altersstufen, Alter bis"]
[null,null,null,5,11,17,18,"%"]
[null,"§ 1612a Abs. 1 BGB in %",null,0.87,1,1.17]
[null,1,0,396,455,533,569,1]
[400,{"$f":"+B90+1","v":2},1901,416,478,560,598,1.0508999999999999]
[{"$f":"+A91","v":400},{"$f":"+B91+1","v":3},{"$f":"+C91+A92","v":2301},436,501,587,626,1.1017999999999999]
[{"$f":"+A92","v":400},4,2701,456,524,613,655,1.1500999999999999]
[400,5,3101,476,546,640,683,1.2010000000000001]
[400,6,3501,507,583,683,729,1.2824]
[400,7,3901,539,619,725,774,1.3613]
[400,8,4301,571,656,768,820,1.4401999999999999]
[400,9,4701,602,592,811,865,1.5216000000000001]
[400,10,5101,634,728,853,911,1.6005]
[{"$f":"+C100-C99","v":400},11,5501,666,765,896,956,{"$f":"ROUND(D100/D$90,2)","v":1.68}]
[{"$f":"+C101-C100","v":700},12,6201,697,801,939,1002,{"$f":"ROUND(D101/D$90,2)","v":1.76}]
[800,13,7001,729,838,981,1047,1.84]
[1000,14,8001,761,874,1024,1093,1.92]
[1500,15,9501,792,910,1066,1138,2]

{"sheet":"Abänderung","index":3,"n_rows":22,"n_cols":8,"rows_kept":22,"cut":false,"hidden":true,"merged":[[14,2,14,3],[13,5,13,6],[14,5,14,6],[21,2,21,3],[15,5,15,6],[21,5,21,6],[19,2,19,3],[19,5,19,6],[15,2,15,3],[3,2,3,3],[13,2,13,3],[7,5,7,6],[8,5,8,6],[9,5,9,6],[10,5,10,6],[3,5,3,6],[7,2,7,3],[8,2,8,3],[9,2,9,3],[10,2,10,3]]}
[null,null,"Kind 1","Kind 2",null,"Kind 1","Kind 2"]
[null,"Alter:",8,null,null,{"$f":"+C2","v":8},{"$f":"+D2","v":0}]
[null,"Altersstufe",{"$f":"IF(C2>=18,4,IF(C2>=12,3,IF(C2>=6,2,1)))","v":2},{"$f":"IF(D2>=18,4,IF(D2>=12,3,IF(D2>=6,2,1)))","v":1},null,{"$f":"IF(F2>=18,4,IF(F2>=12,3,IF(F2>=6,2,1)))","v":2},{"$f":"IF(G2>=18,4,IF(G2>=12,3,IF(G2>=6,2,1)))","v":1}]
[null,{"$f":"\"Einkommen / Einkommensstufe: \"&TEXT(E4,\"#\")&\" / \"&TEXT(H4,\"#\")","v":"Einkommen / Einkommensstufe: 5 / 4"},3100,null,{"$f":"IF(IF(Einkommen<=1500,1,1+ROUNDUP((Einkommen-1500)/400,0))>10,10,IF(Einkommen<=1500,1,1+ROUNDUP((Einkommen-1500)/400,0)))","v":5},{"$f":"+Einkommen","v":3100},null,{"$f":"IF(Einkommen<=1900,1,1+ROUNDUP((Einkommen-1900)/400,0))","v":4}]
[null,"Tabellenbedarf",{"$f":"VLOOKUP(Einkommen+IF(D2=0,400,0),DDorferTab17,C3+1)","v":504},{"$f":"IF(D2=0,0,VLOOKUP(Einkommen,DDorferTab17,D3+1))","v":0},null,{"$f":"VLOOKUP(Einkommen+IF(G2=0,400,0),DDorferTab18,F3+1)","v":479},{"$f":"IF(G2=0,0,VLOOKUP(Einkommen,DDorferTab18,G3+1))","v":0}]
[null,"./. Kindergeld",-96,{"$f":"IF(D2=0,0,-96)","v":0},null,{"$f":"+C6","v":-96},{"$f":"+D6","v":0}]
[null,"Barbedarf",{"$f":"+C6+C5","v":408},{"$f":"+D6+D5","v":0},null,{"$f":"+F6+F5","v":383},{"$f":"+G6+G5","v":0},{"$f":"+G7/D7","v":{"$error":"#DIV/0!"}}]
[null,"Selbstbehalt",1080,null,null,1080]
[null,"angemessener Selbstbehalt",1300,null,null,1300]
[null,"Leistungsfähigkeit zum notw. SB",{"$f":"Einkommen-C8","v":2020},null,null,{"$f":"Einkommen-F8","v":2020}]
[null,"Quote zum notw. SB",{"$f":"+C10/(C7+D7)","v":4.9509803921568629},null,null,{"$f":"+F10/(F7+G7)","v":5.2741514360313317}]
[null,"Unterhalt",{"$f":"ROUND(IF(C11<1,C11*C7,C7),0)","v":408},{"$f":"ROUND(IF(C11<1,C11*D7,D7),0)","v":0},null,{"$f":"ROUND(IF(F11<1,F11*F7,F7),0)","v":383},{"$f":"ROUND(IF(F11<1,F11*G7,G7),0)","v":0}]
[null,"Abweichung",null,null,null,{"$f":"+F12/C12-1","v":-6.1274509803921573E-2},{"$f":"IF(G2=0,\"\",+G12/D12-1)","v":""}]
[null,"Resteinkommen Pflichtiger:",{"$f":"+Einkommen-C12-D12","v":2692},null,null,{"$f":"+Einkommen-F12-G12","v":2717}]
[null,"Leistungsfähigkeit zum angem SB",{"$f":"+Einkommen-C9","v":1800},null,null,{"$f":"+Einkommen-F9","v":1800}]
[null,"Quote zum angem. SB",{"$f":"C15/(C12+D12)","v":4.4117647058823533},null,null,{"$f":"F15/(F12+G12)","v":4.6997389033942563}]
[null,{"$f":"\"Bedarfsreduktion E_Stufe \"&TEXT(E4,\"#\") &\" um -1:\"","v":"Bedarfsreduktion E_Stufe 5 um -1:"},{"$f":"VLOOKUP(Einkommen-400,DDorferTab17,C3+1)","v":452},{"$f":"VLOOKUP(Einkommen-400,DDorferTab17,D3+1)","v":394},null,{"$f":"VLOOKUP(Einkommen-400,DDorferTab18,F3+1)","v":440},{"$f":"VLOOKUP(Einkommen-400,DDorferTab18,G3+1)","v":382}]
[null,{"$f":"+B6","v":"./. Kindergeld"},{"$f":"+C6","v":-96},{"$f":"+D6","v":0},null,{"$f":"+F6","v":-96},{"$f":"+G6","v":0}]
[null,"Barbedarf",{"$f":"+C18+C17","v":356},{"$f":"+D18+D17","v":394},null,{"$f":"+F18+F17","v":344},{"$f":"+G18+G17","v":382}]
[null,"Quote",{"$f":"IF((Einkommen-C8)/(C19+D19)>1,1,(Einkommen-C8)/(C19+D19))","v":1},null,null,{"$f":"IF((Einkommen-F8)/(F19+G19)>1,1,(Einkommen-F8)/(F19+G19))","v":1}]
[null,null,{"$f":"+C20*C19","v":356},{"$f":"+C20*D19","v":394},null,{"$f":"+F20*F19","v":344},{"$f":"+F20*G19","v":382}]
[null,"Resteinkommen Pflichtiger:",{"$f":"+Einkommen-C21-D21","v":2350},null,null,{"$f":"+Einkommen-F21-G21","v":2374}]